I'm trying to build the C# wrappers for RDKit, but have been struggling to make progress. I've attempted two routes the first is outlined here: Trying to build the C# wrappers for RDKit with Docs from /Code/JavaWrappers/csharp_wrapper

The second uses the build.bat found here: https://github.com/bp-kelley/rdkit-csharp

To start I run:

git clone https://github.com/bp-kelley/rdkit-csharp.git
git clone https://github.com/rdkit/rdkit.git
cd rdkit-csharp

Then I have updated the build.bat to use Visual Studio 16 2019 as follows.

Line 95: cmake -G "Visual Studio 16 2019" -A x64 ...

and

Line 111: cmake -G "Visual Studio 16 2019" ...

If someone is able to offer assistance debugging the output below I'd be most grateful.

I have had to cancel the following line:

Downloading: https://dist.nuget.org/win-x86-commandline/latest/nuget.exe to \Desktop\Build\rdkit-csharp\nuget.exe
^CTerminate batch job (Y/N)? n

But have copied nuget.exe into the expected location.

This is most of the output of running build.bat

**PS D:\Desktop\Build> git clone https://github.com/bp-kelley/rdkit-csharp.git
>> git clone https://github.com/rdkit/rdkit.git
>> cd rdkit-csharp
Cloning into 'rdkit-csharp'...
remote: Enumerating objects: 12, done.
remote: Counting objects: 100% (12/12), done.
remote: Compressing objects: 100% (9/9), done.
remote: Total 64 (delta 5), reused 7 (delta 3), pack-reused 52
Unpacking objects: 100% (64/64), done.
Cloning into 'rdkit'...
remote: Enumerating objects: 83, done.
remote: Counting objects: 100% (83/83), done.
remote: Compressing objects: 100% (60/60), done.
remote: Total 61097 (delta 34), reused 38 (delta 22), pack-reused 61014
Receiving objects: 100% (61097/61097), 148.64 MiB | 8.96 MiB/s, done.
Resolving deltas: 100% (46291/46291), done.
Checking out files: 100% (3478/3478), done.
PS D:\Desktop\Build\rdkit-csharp> .\build.bat

D:\Desktop\Build\rdkit-csharp>set THISDIR=D:\Desktop\Build\rdkit-csharp\

D:\Desktop\Build\rdkit-csharp>echo D:\Desktop\Build\rdkit-csharp\
D:\Desktop\Build\rdkit-csharp\

D:\Desktop\Build\rdkit-csharp>set PACKAGE=D:\Desktop\Build\rdkit-csharp\Nuget.Local

D:\Desktop\Build\rdkit-csharp>set BOOST_INCLUDEDIR=D:\Desktop\Build\rdkit-csharp\Nuget.Local/boost.1.69.0.0/lib/native/include

D:\Desktop\Build\rdkit-csharp>set BOOST_LIBRARYDIR=D:\Desktop\Build\rdkit-csharp\Nuget.Local/lib

D:\Desktop\Build\rdkit-csharp>set EIGEN3_INCLUDE_DIR=D:\Desktop\Build\rdkit-csharp\Nuget.Local/Eigen.3.3.3/build/native/include

D:\Desktop\Build\rdkit-csharp>set CAIRO_INCLUDE_DIRS=D:\Desktop\Build\rdkit-csharp\Nuget.Local/cairo.1.12.18.0/build/native/include

D:\Desktop\Build\rdkit-csharp>set CAIRO_LIBRARIES=D:\Desktop\Build\rdkit-csharp\Nuget.Local/lib

D:\Desktop\Build\rdkit-csharp>set CAIRO_LIBRARIES_64=D:\Desktop\Build\rdkit-csharp\Nuget.Local\cairo.1.12.18.0\build\native\lib\x64\v120\Release\dynamic\cairo.lib

D:\Desktop\Build\rdkit-csharp>set CAIRO_LIBRARIES_32=D:\Desktop\Build\rdkit-csharp\Nuget.Local\cairo.1.12.18.0\build\native\lib\Win32\v120\Release\dynamic\cairo.lib

D:\Desktop\Build\rdkit-csharp>call get_nuget https://dist.nuget.org/win-x86-commandline/latest/nuget.exe
Downloading: https://dist.nuget.org/win-x86-commandline/latest/nuget.exe to \Desktop\Build\rdkit-csharp\nuget.exe
^CTerminate batch job (Y/N)? n
Running cmake...
Feeds used:
  C:\Users\Sarco\.nuget\packages\
  https://api.nuget.org/v3/index.json
  C:\Program Files (x86)\Microsoft SDKs\NuGetPackages\



Attempting to gather dependency information for package 'boost-vc140.1.69.0' with respect to project 'D:\Desktop\Build\rdkit-csharp\Nuget.Local', targeting 'Any,Version=v0.0'

///////// TOO LONG TO POST TO STACKOVERFLOW CUT LINES /////////

Build started 11/05/2019 09:36:17.
     1>Project "D:\Desktop\Build\rdkit-csharp\build64\ALL_BUILD.vcxproj" on node 1 (Build target(s)).
     1>D:\Desktop\Build\rdkit-csharp\build64\ALL_BUILD.vcxproj(32,3): error MSB4019: The imported project "D:\Microsoft
       .Cpp.Default.props" was not found. Confirm that the path in the <Import> declaration is correct, and that the fi
       le exists on disk.
     1>Done Building Project "D:\Desktop\Build\rdkit-csharp\build64\ALL_BUILD.vcxproj" (Build target(s)) -- FAILED.

Build FAILED.

       "D:\Desktop\Build\rdkit-csharp\build64\ALL_BUILD.vcxproj" (Build target) (1) ->
         D:\Desktop\Build\rdkit-csharp\build64\ALL_BUILD.vcxproj(32,3): error MSB4019: The imported project "D:\Microso
       ft.Cpp.Default.props" was not found. Confirm that the path in the <Import> declaration is correct, and that the
       file exists on disk.

    0 Warning(s)
    1 Error(s)

Time Elapsed 00:00:00.14

D:\Desktop\Build\rdkit-csharp\build64>copy Code\JavaWrappers\csharp_wrapper\Release\RDKFuncs.dll Code\JavaWrappers\csharp_wrapper
The system cannot find the path specified.

D:\Desktop\Build\rdkit-csharp\build64>copy ..\..\rdkit\Code\JavaWrappers\csharp_wrapper\RDKit2DotNet.csproj Code\JavaWrappers\csharp_wrapper
        1 file(s) copied.

D:\Desktop\Build\rdkit-csharp\build64>robocopy ..\..\rdkit\Code\JavaWrappers\csharp_wrapper\swig_csharp Code\JavaWrappers\csharp_wrapper\swig_csharp /E

-------------------------------------------------------------------------------
   ROBOCOPY     ::     Robust File Copy for Windows
-------------------------------------------------------------------------------

  Started : 11 May 2019 09:36:17
   Source : D:\Desktop\Build\rdkit\Code\JavaWrappers\csharp_wrapper\swig_csharp\
     Dest : D:\Desktop\Build\rdkit-csharp\build64\Code\JavaWrappers\csharp_wrapper\swig_csharp\

    Files : *.*

  Options : *.* /S /E /DCOPY:DA /COPY:DAT /R:1000000 /W:30

------------------------------------------------------------------------------

2019/05/11 09:36:17 ERROR 2 (0x00000002) Accessing Source Directory D:\Desktop\Build\rdkit\Code\JavaWrappers\csharp_wrapper\swig_csharp\
The system cannot find the file specified.

D:\Desktop\Build\rdkit-csharp\build64>copy D:\Desktop\Build\rdkit-csharp\\RDKit.cs  Code\JavaWrappers\csharp_wrapper\swig_csharp\RDKit.cs
The system cannot find the path specified.
        0 file(s) copied.

D:\Desktop\Build\rdkit-csharp\build64>msbuild "Code\JavaWrappers\csharp_wrapper\RDKit2DotNet.csproj" /m /p:Configuration=Release /maxcpucount:4 /t:Build /p:Platform=AnyCPU
Microsoft (R) Build Engine version 4.7.3056.0
[Microsoft .NET Framework, version 4.0.30319.42000]
Copyright (C) Microsoft Corporation. All rights reserved.

Build started 11/05/2019 09:36:18.
     1>Project "D:\Desktop\Build\rdkit-csharp\build64\Code\JavaWrappers\csharp_wrapper\RDKit2DotNet.csproj" on node 1 (
       Build target(s)).
     1>PrepareForBuild:
         Creating directory "bin\Release\".
         Creating directory "obj\Release\".
       GenerateTargetFrameworkMonikerAttribute:
       Skipping target "GenerateTargetFrameworkMonikerAttribute" because all output files are up-to-date with respect t
       o the input files.
       CoreCompile:
         C:\Windows\Microsoft.NET\Framework\v4.0.30319\Csc.exe /noconfig /nowarn:1701,1702 /nostdlib+ /errorreport:prom
         pt /warn:4 /define:TRACE /highentropyva- /reference:"C:\Program Files (x86)\Reference Assemblies\Microsoft\Fra
         mework\.NETFramework\v4.0\Microsoft.CSharp.dll" /reference:"C:\Program Files (x86)\Reference Assemblies\Micros
         oft\Framework\.NETFramework\v4.0\mscorlib.dll" /reference:"C:\Program Files (x86)\Reference Assemblies\Microso
         ft\Framework\.NETFramework\v4.0\System.Core.dll" /reference:"C:\Program Files (x86)\Reference Assemblies\Micro
         soft\Framework\.NETFramework\v4.0\System.Data.DataSetExtensions.dll" /reference:"C:\Program Files (x86)\Refere
         nce Assemblies\Microsoft\Framework\.NETFramework\v4.0\System.Data.dll" /reference:"C:\Program Files (x86)\Refe
         rence Assemblies\Microsoft\Framework\.NETFramework\v4.0\System.dll" /reference:"C:\Program Files (x86)\Referen
         ce Assemblies\Microsoft\Framework\.NETFramework\v4.0\System.Xml.dll" /reference:"C:\Program Files (x86)\Refere
         nce Assemblies\Microsoft\Framework\.NETFramework\v4.0\System.Xml.Linq.dll" /debug:pdbonly /filealign:512 /opti
         mize+ /out:obj\Release\RDKit2DotNet.dll /target:library /utf8output
     1>CSC : warning CS2008: No source files specified [D:\Desktop\Build\rdkit-csharp\build64\Code\JavaWrappers\csharp_
       wrapper\RDKit2DotNet.csproj]
     1>C:\Windows\Microsoft.NET\Framework\v4.0.30319\Microsoft.Common.targets(3713,5): error MSB3030: Could not copy th
       e file "D:\Desktop\Build\rdkit-csharp\build64\Code\JavaWrappers\csharp_wrapper\RDKFuncs.dll" because it was not
       found. [D:\Desktop\Build\rdkit-csharp\build64\Code\JavaWrappers\csharp_wrapper\RDKit2DotNet.csproj]
     1>Done Building Project "D:\Desktop\Build\rdkit-csharp\build64\Code\JavaWrappers\csharp_wrapper\RDKit2DotNet.cspro
       j" (Build target(s)) -- FAILED.

Build FAILED.

       "D:\Desktop\Build\rdkit-csharp\build64\Code\JavaWrappers\csharp_wrapper\RDKit2DotNet.csproj" (Build target) (1)
       ->
       (CoreCompile target) ->
         CSC : warning CS2008: No source files specified [D:\Desktop\Build\rdkit-csharp\build64\Code\JavaWrappers\cshar
       p_wrapper\RDKit2DotNet.csproj]


       "D:\Desktop\Build\rdkit-csharp\build64\Code\JavaWrappers\csharp_wrapper\RDKit2DotNet.csproj" (Build target) (1)
       ->
       (_CopyOutOfDateSourceItemsToOutputDirectoryAlways target) ->
         C:\Windows\Microsoft.NET\Framework\v4.0.30319\Microsoft.Common.targets(3713,5): error MSB3030: Could not copy
       the file "D:\Desktop\Build\rdkit-csharp\build64\Code\JavaWrappers\csharp_wrapper\RDKFuncs.dll" because it was no
       t found. [D:\Desktop\Build\rdkit-csharp\build64\Code\JavaWrappers\csharp_wrapper\RDKit2DotNet.csproj]

    1 Warning(s)
    1 Error(s)

Time Elapsed 00:00:00.63

D:\Desktop\Build\rdkit-csharp\build64>REM build x86

D:\Desktop\Build\rdkit-csharp\build64>cd D:\Desktop\Build\rdkit-csharp\

D:\Desktop\Build\rdkit-csharp>mkdir build32

D:\Desktop\Build\rdkit-csharp>cd build32

D:\Desktop\Build\rdkit-csharp\build32>cmake -G "Visual Studio 16 2019" -DCMAKE_INSTALL_PREFIX= -DRDK_BUILD_PYTHON_WRAPPERS=OFF -DRDK_BUILD_SWIG_WRAPPERS=ON -DRDK_BUILD_SWIG_JAVA_WRAPPER=OFF -DRDK_BUILD_SWIG_CSHARP_WRAPPER=ON -DBOOST_INCLUDEDIR="D:\Desktop\Build\rdkit-csharp\Nuget.Local/boost.1.69.0.0/lib/native/include" -DBOOST_LIBRARYDIR="D:\Desktop\Build\rdkit-csharp\Nuget.Local/lib32" -DBoost_USE_STATIC-LIBS=ON -DEIGEN3_INCLUDE_DIR="D:\Desktop\Build\rdkit-csharp\Nuget.Local/Eigen.3.3.3/build/native/include" -DRDK_INSTALL_INTREE=OFF -DCPACK_INSTALL_PREFIX=rdkit -DRDK_BUILD_THREADSAFE_SSS=ON -DRDK_BUILD_AVALON_SUPPORT=ON -DRDK_BUILD_INCHI_SUPPORT=ON -DRDK_BUILD_CPP_TESTS=ON -DRDK_BUILD_CAIRO_SUPPORT=ON -DCAIRO_INCLUDE_DIRS="D:\Desktop\Build\rdkit-csharp\Nuget.Local/cairo.1.12.18.0/build/native/include" -DCAIRO_LIBRARIES="D:\Desktop\Build\rdkit-csharp\Nuget.Local\cairo.1.12.18.0\build\native\lib\Win32\v120\Release\dynamic\cairo.lib" ..\..\rdkit
-- Selecting Windows SDK version 10.0.17763.0 to target Windows 10.0.17134.
-- The C compiler identification is MSVC 19.20.27508.1
-- The CXX compiler identification is MSVC 19.20.27508.1
-- Check for working C compiler: D:/Program Files (x86)/Microsoft Visual Studio/2019/Community/VC/Tools/MSVC/14.20.27508/bin/Hostx64/x64/cl.exe
-- Check for working C compiler: D:/Program Files (x86)/Microsoft Visual Studio/2019/Community/VC/Tools/MSVC/14.20.27508/bin/Hostx64/x64/cl.exe -- works
-- Detecting C compiler ABI info
-- Detecting C compiler ABI info - done
-- Detecting C compile features
-- Detecting C compile features - done
-- Check for working CXX compiler: D:/Program Files (x86)/Microsoft Visual Studio/2019/Community/VC/Tools/MSVC/14.20.27508/bin/Hostx64/x64/cl.exe
-- Check for working CXX compiler: D:/Program Files (x86)/Microsoft Visual Studio/2019/Community/VC/Tools/MSVC/14.20.27508/bin/Hostx64/x64/cl.exe -- works
-- Detecting CXX compiler ABI info
-- Detecting CXX compiler ABI info - done
-- Detecting CXX compile features
-- Detecting CXX compile features - done
-- Check if the system is big endian
-- Searching 16 bit integer
-- Looking for sys/types.h
-- Looking for sys/types.h - found
-- Looking for stdint.h
-- Looking for stdint.h - found
-- Looking for stddef.h
-- Looking for stddef.h - found
-- Check size of unsigned short
-- Check size of unsigned short - done
-- Using unsigned short
-- Check if the system is big endian - little endian
-- Found Catch2 source in D:/Desktop/Build/rdkit/External/catch/catch
CATCH: D:/Desktop/Build/rdkit/External/catch/catch/single_include
-- Could NOT find InChI in system locations (missing: INCHI_LIBRARY INCHI_INCLUDE_DIR)
CUSTOM_INCHI_PATH = D:/Desktop/Build/rdkit/External/INCHI-API
-- Found InChI software locally
-- Boost version: 1.69.0
-- Looking for pthread.h
-- Looking for pthread.h - not found
-- Found Threads: TRUE
-- Could NOT find Boost
== Using strict rotor definition
-- maeparser include dir set as 'maeparser_INCLUDE_DIRS-NOTFOUND'
-- maeparser libraries set as 'maeparser_LIBRARIES-NOTFOUND'
-- Could NOT find maeparser (missing: maeparser_INCLUDE_DIRS maeparser_LIBRARIES)
-- Found MAEParser source in D:/Desktop/Build/rdkit/External/CoordGen/maeparser
CMake Error at D:/Program Files/CMake/share/cmake-3.14/Modules/FindBoost.cmake:2147 (message):
  Unable to find the requested Boost libraries.

  Boost version: 1.69.0

  Boost include path:
  D:/Desktop/Build/rdkit-csharp/Nuget.Local/boost.1.69.0.0/lib/native/include


  Could not find the following Boost libraries:

          boost_system
          boost_iostreams

  Some (but not all) of the required Boost libraries were found.  You may
  need to install these additional Boost libraries.  Alternatively, set
  BOOST_LIBRARYDIR to the directory containing Boost libraries or BOOST_ROOT
  to the location of Boost.
Call Stack (most recent call first):
  External/CoordGen/CMakeLists.txt:39 (find_package)


-- coordgen include dir set as coordgen_INCLUDE_DIRS-NOTFOUND
-- coordgen libraries set as 'coordgen_LIBRARIES-NOTFOUND'
-- coordgen templates file set as 'coordgen_TEMPLATE_FILE-NOTFOUND'
-- Could NOT find coordgen (missing: coordgen_INCLUDE_DIRS coordgen_LIBRARIES coordgen_TEMPLATE_FILE)
-- Found coordgenlibs source in D:/Desktop/Build/rdkit/External/CoordGen/coordgen
-- Could NOT find ZLIB (missing: ZLIB_LIBRARY ZLIB_INCLUDE_DIR)
CMake Error at D:/Program Files/CMake/share/cmake-3.14/Modules/FindBoost.cmake:2147 (message):
  Unable to find the requested Boost libraries.

  Boost version: 1.69.0

  Boost include path:
  D:/Desktop/Build/rdkit-csharp/Nuget.Local/boost.1.69.0.0/lib/native/include


  Could not find the following Boost libraries:

          boost_system
          boost_iostreams

  Some (but not all) of the required Boost libraries were found.  You may
  need to install these additional Boost libraries.  Alternatively, set
  BOOST_LIBRARYDIR to the directory containing Boost libraries or BOOST_ROOT
  to the location of Boost.
Call Stack (most recent call first):
  Code/RDStreams/CMakeLists.txt:4 (find_package)


-- Could NOT find Boost
CMake Error at D:/Program Files/CMake/share/cmake-3.14/Modules/FindBoost.cmake:2147 (message):
  Unable to find the requested Boost libraries.

  Boost version: 1.69.0

  Boost include path:
  D:/Desktop/Build/rdkit-csharp/Nuget.Local/boost.1.69.0.0/lib/native/include


  Could not find the following Boost libraries:

          boost_system
          boost_iostreams

  Some (but not all) of the required Boost libraries were found.  You may
  need to install these additional Boost libraries.  Alternatively, set
  BOOST_LIBRARYDIR to the directory containing Boost libraries or BOOST_ROOT
  to the location of Boost.
Call Stack (most recent call first):
  Code/GraphMol/FileParsers/CMakeLists.txt:7 (find_package)


-- Could NOT find Boost
== Making EnumerateLibrary without boost Serialization support
== Making FilterCatalog without boost Serialization support
-- Found PythonInterp: D:/Program Files/Python36-32/python.exe (found version "3.6.3")
== Updating Filters.cpp from pains file
== Done updating pains files
-- Could NOT find PkgConfig (missing: PKG_CONFIG_EXECUTABLE)
-- Found Cairo: D:/Desktop/Build/rdkit-csharp/Nuget.Local/cairo.1.12.18.0/build/native/include
== Making SubstructLibrary without boost Serialization support
-- Found RapidJSON source in D:/Desktop/Build/rdkit/External
-- Found SWIG: C:/swig/swig.exe (found version "4.0.0")
CMake Error at D:/Program Files/CMake/share/cmake-3.14/Modules/FindBoost.cmake:2147 (message):
  Unable to find the requested Boost libraries.

  Boost version: 1.69.0

  Boost include path:
  D:/Desktop/Build/rdkit-csharp/Nuget.Local/boost.1.69.0.0/lib/native/include


  Could not find the following Boost libraries:

          boost_system
          boost_iostreams

  Some (but not all) of the required Boost libraries were found.  You may
  need to install these additional Boost libraries.  Alternatively, set
  BOOST_LIBRARYDIR to the directory containing Boost libraries or BOOST_ROOT
  to the location of Boost.
Call Stack (most recent call first):
  Code/JavaWrappers/CMakeLists.txt:43 (find_package)


-- Could NOT find Boost
SUFFIX:
JAVA_LIBS: AvalonLib;avalon_clib;RDInchiLib;Inchi;RGroupDecomposition;SubstructLibrary;MolStandardize;FilterCatalog;Catalogs;FMCS;MolDraw2D;FileParsers;SmilesParse;Depictor;SubstructMatch;ChemReactions;Fingerprints;ChemTransforms;Subgraphs;GraphMol;DataStructs;Trajectory;Descriptors;PartialCharges;MolTransforms;DistGeomHelpers;DistGeometry;ForceFieldHelpers;ForceField;EigenSolvers;Optimizer;MolAlign;Alignment;SimDivPickers;RDGeometryLib;RDStreams;RDGeneral
CMake Warning (dev) at D:/Program Files/CMake/share/cmake-3.14/Modules/UseSWIG.cmake:600 (message):
  Policy CMP0078 is not set: UseSWIG generates standard target names.  Run
  "cmake --help-policy CMP0078" for policy details.  Use the cmake_policy
  command to set the policy and suppress this warning.

Call Stack (most recent call first):
  Code/JavaWrappers/csharp_wrapper/CMakeLists.txt:63 (SWIG_ADD_LIBRARY)
This warning is for project developers.  Use -Wno-dev to suppress it.

CMake Warning (dev) at D:/Program Files/CMake/share/cmake-3.14/Modules/UseSWIG.cmake:460 (message):
  Policy CMP0086 is not set: UseSWIG honors SWIG_MODULE_NAME via -module
  flag.  Run "cmake --help-policy CMP0086" for policy details.  Use the
  cmake_policy command to set the policy and suppress this warning.

Call Stack (most recent call first):
  D:/Program Files/CMake/share/cmake-3.14/Modules/UseSWIG.cmake:695 (SWIG_ADD_SOURCE_TO_MODULE)
  Code/JavaWrappers/csharp_wrapper/CMakeLists.txt:63 (SWIG_ADD_LIBRARY)
This warning is for project developers.  Use -Wno-dev to suppress it.

-- Configuring incomplete, errors occurred!
See also "D:/Desktop/Build/rdkit-csharp/build32/CMakeFiles/CMakeOutput.log".
See also "D:/Desktop/Build/rdkit-csharp/build32/CMakeFiles/CMakeError.log".

D:\Desktop\Build\rdkit-csharp\build32>msbuild "ALL_BUILD.vcxproj" /m /p:PlatformTarget=x86 /p:Configuration=Release /maxcpucount:4 /t:Build
Microsoft (R) Build Engine version 4.7.3056.0
[Microsoft .NET Framework, version 4.0.30319.42000]
Copyright (C) Microsoft Corporation. All rights reserved.

MSBUILD : error MSB1009: Project file does not exist.
Switch: ALL_BUILD.vcxproj

D:\Desktop\Build\rdkit-csharp\build32>copy Code\JavaWrappers\csharp_wrapper\Release\RDKFuncs.dll Code\JavaWrappers\csharp_wrapper
The system cannot find the path specified.

D:\Desktop\Build\rdkit-csharp\build32>copy ..\..\rdkit\Code\JavaWrappers\csharp_wrapper\RDKit2DotNet.csproj Code\JavaWrappers\csharp_wrapper
        1 file(s) copied.

D:\Desktop\Build\rdkit-csharp\build32>robocopy ..\..\rdkit\Code\JavaWrappers\csharp_wrapper\swig_csharp Code\JavaWrappers\csharp_wrapper\swig_csharp /E

-------------------------------------------------------------------------------
   ROBOCOPY     ::     Robust File Copy for Windows
-------------------------------------------------------------------------------

  Started : 11 May 2019 09:36:36
   Source : D:\Desktop\Build\rdkit\Code\JavaWrappers\csharp_wrapper\swig_csharp\
     Dest : D:\Desktop\Build\rdkit-csharp\build32\Code\JavaWrappers\csharp_wrapper\swig_csharp\

    Files : *.*

  Options : *.* /S /E /DCOPY:DA /COPY:DAT /R:1000000 /W:30

------------------------------------------------------------------------------

2019/05/11 09:36:36 ERROR 2 (0x00000002) Accessing Source Directory D:\Desktop\Build\rdkit\Code\JavaWrappers\csharp_wrapper\swig_csharp\
The system cannot find the file specified.

D:\Desktop\Build\rdkit-csharp\build32>copy D:\Desktop\Build\rdkit-csharp\\RDKit.cs  Code\JavaWrappers\csharp_wrapper\swig_csharp\RDKit.cs
The system cannot find the path specified.
        0 file(s) copied.

D:\Desktop\Build\rdkit-csharp\build32>msbuild "Code\JavaWrappers\csharp_wrapper\RDKit2DotNet.csproj" /m /p:Configuration=Release /maxcpucount:4 /t:Build /p:Platform=AnyCPU
Microsoft (R) Build Engine version 4.7.3056.0
[Microsoft .NET Framework, version 4.0.30319.42000]
Copyright (C) Microsoft Corporation. All rights reserved.

Build started 11/05/2019 09:36:36.
     1>Project "D:\Desktop\Build\rdkit-csharp\build32\Code\JavaWrappers\csharp_wrapper\RDKit2DotNet.csproj" on node 1 (
       Build target(s)).
     1>PrepareForBuild:
         Creating directory "bin\Release\".
         Creating directory "obj\Release\".
       GenerateTargetFrameworkMonikerAttribute:
       Skipping target "GenerateTargetFrameworkMonikerAttribute" because all output files are up-to-date with respect t
       o the input files.
       CoreCompile:
         C:\Windows\Microsoft.NET\Framework\v4.0.30319\Csc.exe /noconfig /nowarn:1701,1702 /nostdlib+ /errorreport:prom
         pt /warn:4 /define:TRACE /highentropyva- /reference:"C:\Program Files (x86)\Reference Assemblies\Microsoft\Fra
         mework\.NETFramework\v4.0\Microsoft.CSharp.dll" /reference:"C:\Program Files (x86)\Reference Assemblies\Micros
         oft\Framework\.NETFramework\v4.0\mscorlib.dll" /reference:"C:\Program Files (x86)\Reference Assemblies\Microso
         ft\Framework\.NETFramework\v4.0\System.Core.dll" /reference:"C:\Program Files (x86)\Reference Assemblies\Micro
         soft\Framework\.NETFramework\v4.0\System.Data.DataSetExtensions.dll" /reference:"C:\Program Files (x86)\Refere
         nce Assemblies\Microsoft\Framework\.NETFramework\v4.0\System.Data.dll" /reference:"C:\Program Files (x86)\Refe
         rence Assemblies\Microsoft\Framework\.NETFramework\v4.0\System.dll" /reference:"C:\Program Files (x86)\Referen
         ce Assemblies\Microsoft\Framework\.NETFramework\v4.0\System.Xml.dll" /reference:"C:\Program Files (x86)\Refere
         nce Assemblies\Microsoft\Framework\.NETFramework\v4.0\System.Xml.Linq.dll" /debug:pdbonly /filealign:512 /opti
         mize+ /out:obj\Release\RDKit2DotNet.dll /target:library /utf8output
     1>CSC : warning CS2008: No source files specified [D:\Desktop\Build\rdkit-csharp\build32\Code\JavaWrappers\csharp_
       wrapper\RDKit2DotNet.csproj]
     1>C:\Windows\Microsoft.NET\Framework\v4.0.30319\Microsoft.Common.targets(3713,5): error MSB3030: Could not copy th
       e file "D:\Desktop\Build\rdkit-csharp\build32\Code\JavaWrappers\csharp_wrapper\RDKFuncs.dll" because it was not
       found. [D:\Desktop\Build\rdkit-csharp\build32\Code\JavaWrappers\csharp_wrapper\RDKit2DotNet.csproj]
     1>Done Building Project "D:\Desktop\Build\rdkit-csharp\build32\Code\JavaWrappers\csharp_wrapper\RDKit2DotNet.cspro
       j" (Build target(s)) -- FAILED.

Build FAILED.

       "D:\Desktop\Build\rdkit-csharp\build32\Code\JavaWrappers\csharp_wrapper\RDKit2DotNet.csproj" (Build target) (1)
       ->
       (CoreCompile target) ->
         CSC : warning CS2008: No source files specified [D:\Desktop\Build\rdkit-csharp\build32\Code\JavaWrappers\cshar
       p_wrapper\RDKit2DotNet.csproj]


       "D:\Desktop\Build\rdkit-csharp\build32\Code\JavaWrappers\csharp_wrapper\RDKit2DotNet.csproj" (Build target) (1)
       ->
       (_CopyOutOfDateSourceItemsToOutputDirectoryAlways target) ->
         C:\Windows\Microsoft.NET\Framework\v4.0.30319\Microsoft.Common.targets(3713,5): error MSB3030: Could not copy
       the file "D:\Desktop\Build\rdkit-csharp\build32\Code\JavaWrappers\csharp_wrapper\RDKFuncs.dll" because it was no
       t found. [D:\Desktop\Build\rdkit-csharp\build32\Code\JavaWrappers\csharp_wrapper\RDKit2DotNet.csproj]

    1 Warning(s)**

0 Answers